{"text_format":"1","workbook":"xlsx","n_sheets":7,"sheets":["Quotation","Finance Quote","CBA","Calculations","Workings (A)","Workings (B)","Workings (C)"],"not_rendered":{"charts":1,"images":1,"macros":1,"external_links":0,"defined_names":14,"comments":5,"pivot_tables":0},"unopened":[],"bounds":{"document_bytes":16777216,"sheet_cells":100000,"rows_first":2000,"rows_last":500,"rows_between":2000,"halvings":0,"cell_chars":16384,"cell_head_chars":4096},"cells_cut":0,"cells_raw":0,"read":"whole","date_system":"1900"}

{"sheet":"Quotation","index":0,"n_rows":51,"n_cols":22,"rows_kept":51,"cut":false,"hidden":false,"merged":[[50,1,50,16],[30,1,30,9],[18,5,18,11],[13,2,13,4],[14,2,14,4],[15,2,15,4],[22,2,22,4],[21,2,21,4],[27,2,27,4],[25,2,25,4],[24,2,24,4]]}
[]
[]
[]
[]
[]
[]
[]
[]
[]
[]
[]
[null,"APR Calculator",null,null,null,null,null,null,null,null,null,null,null,null,null,null,"Quotation Model"]
[null,null,"Scenario 1","Scenario 2","Scenario 3"]
[null,"Broker Name:","[Broker Name]",null,null,null,null,null,null,null,null,null,null,null,null,null,"Total Amount Payable:",null,null,null,{"$f":"IF(U15=C20,'Workings (A)'!C22,IF(U15=D20,'Workings (B)'!C22,'Workings (C)'!C22))","v":1039545}]
[null,"Client Name:","[Client Name]",null,null,null,null,null,null,null,null,null,null,null,null,null,"Number of  Payments:***",null,null,null,10,"Please input the No of payments"]
[null,"Initial Transaction Amount:",1000000,null,null,null,null,null,null,null,null,null,null,null,null,null,"Fee Amount:",null,null,null,{"$f":"IF(U15=C20,'Workings (A)'!C17,IF(U15=D20,'Workings (B)'!C17,'Workings (C)'!C17))","v":45},"Collected with the initial payment"]
[null,"Facility Fee:","Yes","Yes","Yes","Please select if fee applies",null,null,null,null,null,null,null,null,null,null,"First payment amount collected by broker",null,null,null,0]
[null,"Transaction Fee",2.4E-2,3.2000000000000001E-2,3.95E-2,null,null,null,null,null,null,null,null,null,null,null,"Initial Direct Debit of:",null,null,null,{"$f":"IF(U15=C20,IF(U17=0,'Workings (A)'!C24,U19+'Workings (A)'!C17),IF(U15=D20,IF(U17=0,'Workings (B)'!C24,U19+'Workings (B)'!C17),IF(U17=0,'Workings (C)'!C24,U19+'Workings (C)'!C17)))","v":103995}]
[null,"Minimum Transaction Fee *",25,25,25,"* Please input the amount",null,null,null,null,null,null,null,null,null,null,"Followed by",{"$f":"IF(U17=0,(U15-1),U15-2)","v":9},"payments of:",null,{"$f":"IF(U15=C20,IF(U17=0,('Workings (A)'!C22-'Workings (A)'!C17)/U15,('Workings (A)'!C22-'Workings (A)'!C17-U17)/(U15-1)),IF(U15=E20,IF(U17=0,('Workings (C)'!C22-'Workings (C)'!C17)/U15,('Workings (C)'!C22-'Workings (C)'!C17-U17)/(U15-1)),IF(U17=0,('Workings (B)'!C22-'Workings (B)'!C17)/U15,('Workings (B)'!C22-'Workings (B)'!C17-U17)/(U15-1))))","v":103950}]
[null,"Instalment Term",6,8,10,null,null,null,null,null,null,null,null,null,null,null,"Anticipated Credit Limit:",null,null,null,{"$f":"IF(U15=C20,'Workings (A)'!C23,IF(U15=D20,'Workings (B)'!C23,'Workings (C)'!C23))","v":1039545}]
[]
[null,"Corporation Tax Rate:",19,null,null,"%",null,null,null,null,null,null,null,null,null,null,{"$f":"\"*** This is the total number of monthly instalments, including the first payment amount, which may have been collected by \"&C14","v":"*** This is the total number of monthly instalments, including the first payment amount, which may have been collected by [Broker Name]"}]
[null,"Client ROCE:**",10,null,null,"%"]
[]
[null,"Show Corporation Tax","Yes"]
[null,"Show APR","No"]
[null,"APR",{"$f":"'Workings (A)'!B28","v":4.4999999999999998E-2},{"$f":"'Workings (B)'!B28","v":0.06},{"$f":"'Workings (C)'!B28","v":7.4999999999999997E-2},"   APR Variable"]
[null,"Currency","£"]
[]
[null,"This APR is calculated on the assumptions that:"]
[null,"• The credit agreement remains valid for the period agreed and that the parties to the credit agreement fulfil their obligations under the terms and by the dates specified in the agreement;",null,null,null,null,null,null,null,null,null,null,null,null,null,null,null,"Overall cashflow position",null,null,{"$f":"Calculations!T26","v":0}]
[null,"• The rate of the transaction fee will remain at the initial level and will be applicable for the duration of the agreement;",null,null,null,null,null,null,null,null,null,null,null,null,null,null,null,"A positive figure indicates a favourable cashflow position by using premium finance"]
[null,"• The Anticipated Credit Limit is drawn down immediately and in full;"]
[null,"• The credit is provided for a period of one year starting from the date of the initial drawdown, the capital is repaid in  equal 12"]
[null,"monthly payments commencing one month after the date of the initial drawdown, the final payment made by the borrower clears the"]
[null,"balance of capital and charges, and that charges are applied in accordance with that drawdown and repayments of capital and as"]
[null,"provided for in the consumer credit agreement."]
[null,"• The facility fee is collected in full with the first payment"]
[]
[]
{"$rows_left_out":12}
{"sheet":"Finance Quote","index":1,"n_rows":47,"n_cols":7,"rows_kept":47,"cut":false,"hidden":false,"merged":[[11,0,11,3],[12,0,12,3],[12,4,12,7],[32,6,33,6],[35,1,36,3],[35,4,36,4],[35,5,36,5],[35,6,36,6],[27,1,29,3],[27,4,29,4],[27,5,29,5],[11,4,11,7],[15,1,15,3],[17,1,18,3],[17,4,18,4],[17,5,18,5],[52,0,52,7],[53,0,53,7],[32,1,33,3],[32,4,33,4],[32,5,33,5],[42,0,43,7],[46,0,47,7],[17,6,18,6],[19,1,20,3],[19,4,20,4],[19,6,20,6],[19,5,20,5],[27,6,29,6],[26,1,26,3],[21,6,22,6],[23,5,24,5],[23,6,24,6],[21,1,22,3],[23,1,24,3],[21,4,22,4],[23,4,24,4],[21,5,22,5]]}
[]
[]
[]
[]
[]
[]
[]
[]
[]
[null,"Finance Quotation"]
[]
["Broker:",null,null,null,{"$f":"Quotation!C14","v":"[Broker Name]"}]
["Analysis for:","Analysis for:",{"$f":"Quotation!L15","v":0},{"$f":"Quotation!P10","v":0},{"$f":"Quotation!C15","v":"[Client Name]"}]
[]
[]
[null,"Number of Payments",null,null,{"$f":"IF(Quotation!C20=0,\"x\",Quotation!C20)","v":6},{"$f":"IF(Quotation!D20=0,\"x\",Quotation!D20)","v":8},{"$f":"IF(Quotation!E20=0,\"x\",Quotation!E20)","v":10}]
[]
[null,"Initial Premium",null,null,{"$f":"IF($E$16=\"x\",\"x\",Quotation!C16)","v":1000000},{"$f":"IF($F$16=\"x\",\"x\",Quotation!C16)","v":1000000},{"$f":"IF($G$16=\"x\",\"x\",Quotation!C16)","v":1000000}]
[]
[null,"Transaction Charge",null,null,{"$f":"IF($E$16=\"x\",\"x\",'Workings (A)'!C19/E18)","v":2.4E-2},{"$f":"IF($F$16=\"x\",\"x\",'Workings (B)'!C19/F18)","v":3.2000000000000001E-2},{"$f":"IF($G$16=\"x\",\"x\",'Workings (C)'!C19/G18)","v":3.95E-2}]
[]
[null,"Facility Fee",null,null,{"$f":"IF($E$16=\"x\",\"x\",'Workings (A)'!C17)","v":45},{"$f":"IF($F$16=\"x\",\"x\",'Workings (B)'!C17)","v":45},{"$f":"IF($G$16=\"x\",\"x\",'Workings (C)'!C17)","v":45}]
[]
[null,"Total Amount Payable",null,null,{"$f":"IF($E$16=\"x\",\"x\",'Workings (A)'!C22)","v":1024045},{"$f":"IF($F$16=\"x\",\"x\",'Workings (B)'!C22)","v":1032045},{"$f":"IF($G$16=\"x\",\"x\",'Workings (C)'!C22)","v":1039545}]
[]
[]
[null,"Initial Payment",null,null,{"$f":"IF($E$16=\"x\",\"x\",'Workings (A)'!C24)","v":170711.66666666666},{"$f":"IF($F$16=\"x\",\"x\",'Workings (B)'!C24)","v":129045},{"$f":"IF($G$16=\"x\",\"x\",'Workings (C)'!C24)","v":103995}]
[null,"Remaining Payments of",null,null,{"$f":"IF($E$16=\"x\",\"x\",'Workings (A)'!C25)","v":170666.66666666666},{"$f":"IF($F$16=\"x\",\"x\",'Workings (B)'!C25)","v":129000},{"$f":"IF($G$16=\"x\",\"x\",'Workings (C)'!C25)","v":103950}]
[]
[]
[]
[]
[null,"APR",null,null,{"$f":"IF($E$16=\"x\",\"x\",'Workings (A)'!B28)","v":4.4999999999999998E-2},{"$f":"IF($F$16=\"x\",\"x\",'Workings (B)'!B28)","v":0.06},{"$f":"IF($G$16=\"x\",\"x\",'Workings (C)'!B28)","v":7.4999999999999997E-2}]
[]
[]
[null,"Corporation Tax Savings",null,null,{"$f":"IF(E16=\"x\",\"x\",E20*E18*CBA!$C$23/100)","v":4560},{"$f":"IF(F16=\"x\",\"x\",F20*F18*CBA!$C$23/100)","v":6080},{"$f":"IF(G16=\"x\",\"x\",G20*G18*CBA!$C$23/100)","v":7505}]
[]
[]
[]
[]
{"$rows_left_out":8}
{"sheet":"CBA","index":2,"n_rows":56,"n_cols":8,"rows_kept":56,"cut":false,"hidden":false,"merged":[[15,1,15,7],[9,1,9,2],[11,3,11,7],[12,3,12,7],[48,1,48,7],[50,1,50,7],[52,1,52,7],[55,1,55,2],[27,4,27,6],[28,1,28,7],[30,1,30,7],[27,1,27,2]]}
[]
[]
[]
[]
[]
[]
[]
[]
[]
[null,"Cost Benefit Analysis"]
[]
[null,null,"Broker:",{"$f":"Quotation!C14","v":"[Broker Name]"},{"$f":"Quotation!G9","v":0},{"$f":"Quotation!H9","v":0},{"$f":"Quotation!I9","v":0},{"$f":"Quotation!J9","v":0}]
[null,null,"Analysis for:",{"$f":"Quotation!C15","v":"[Client Name]"},{"$f":"Quotation!G10","v":0},{"$f":"Quotation!H10","v":0},{"$f":"Quotation!I10","v":0},{"$f":"Quotation!J10","v":0}]
[]
[]
[null,"Using both the return on capital employed percentage together with the additional saving to corporation tax this analysis demonstrates the effect on your cashflow position by using premium finance instead of paying the full premium upfront from cash."]
[]
[]
[null,"Premium Amount:",{"$f":"Quotation!C16","v":1000000},null,"Total Amount Payable:",null,null,{"$f":"Quotation!U14","v":1039545}]
[null,"Monthly Instalments:* ",{"$f":"Quotation!U15","v":10},null,"Initial Direct Debit of:",null,null,{"$f":"Quotation!U18","v":103995}]
[null,"Transaction Charge",{"$f":"HLOOKUP(C20,'Finance Quote'!E16:G21,5,FALSE)","v":3.95E-2},null,"Followed by",{"$f":"Quotation!R19","v":9},"payments of:",{"$f":"Quotation!U19","v":103950}]
[null,"Corporation Tax Savings",{"$f":"HLOOKUP(C20,'Finance Quote'!E16:G38,21,FALSE)","v":7505}]
[null,"Corporation Tax Rate:",{"$f":"Quotation!C22","v":19},"%"]
[null,"Client ROCE:**",{"$f":"Quotation!C23","v":10},"%"]
[null,"APR",{"$f":"HLOOKUP(C20,Quotation!C20:E27,8,FALSE)","v":7.4999999999999997E-2}]
[]
[]
[null,"Overall cashflow position",null,null,{"$f":"Calculations!T26","v":0}]
[null,"This positive figure indicates a favourable cashflow position by using premium finance"]
[]
[]
[]
[]
[]
[]
[]
[]
[]
[]
[]
{"$rows_left_out":17}
{"sheet":"Calculations","index":3,"n_rows":84,"n_cols":20,"rows_kept":84,"cut":false,"hidden":true,"merged":[[9,11,10,11],[9,12,10,12],[9,10,10,10],[9,15,10,15],[9,13,10,13],[9,21,10,21],[9,17,10,17],[9,18,10,18],[9,19,10,19],[9,14,10,14],[9,16,10,16]]}
[" ",null,null,null,null,null,null,null,null,null,null,"CALCULATION OF APR % ( Annual Percentage Rate of Charge)"]
[]
[" ",null,null,null,"Deposit",{"$f":"Quotation!U17","v":0}]
[null,"PREMIUM",{"$f":"Quotation!C16","v":1000000},null,"Initial Inst",{"$f":"Quotation!U18","v":103995}]
[null,null,null,null,"Followed by",{"$f":"Quotation!U19","v":103950},"Input Flat % and Term to obtain Apr%"]
[null,"SERVICE CHARGE",{"$f":"HLOOKUP(C8,CBA!C20:C21,2,FALSE)*C4","v":39500},null,"Flat rate %",{"$f":"C6/C4","v":3.95E-2}]
[]
[null,"No OF INSTALMENTS",{"$f":"Quotation!U15","v":10},null,null,null,null,null,null,null,null,null,null,null,null,null,null,"Client ROCE","Corp Tax %"]
[null,null,null,null,null,null,null,null,null,null,null,null,null,null,null,null,null,{"$f":"Quotation!C23","v":10},{"$f":"Quotation!C22","v":19}]
[null,"ESTIMATED EIR",10.938630859591354,null,null,null,null,null,null,null,"Month","Instalments paid in advance","Loan Balance Remaining","Service Charge Element","Premium finance service\ncharge (interest) net of tax","Capital Portion Paid Off","Investment Balance Remaining","Return On Capital Employed\n(Net of tax)","Tax Deducted","Profit/(Loss)"]
[]
[null,null,null,null,null,null,null,null,null,null,1,{"$f":"IF(F3>0,F3,IF($F$4>0,$F$4,F5))","v":103995},{"$f":"C4-L12","v":896005},{"$f":"M12*$C$10/100/12","v":8167.5566194567919},{"$f":"N12-S12","v":6615.7208617600018},{"$f":"L12-N12","v":95827.443380543205},{"$f":"M12","v":896005},{"$f":"Q12*($R$9/100)/12","v":7466.708333333333},{"$f":"N12*$S$9/100","v":1551.8357576967903},{"$f":"R12-(N12-S12)","v":850.98747157333128}]
[null,null,null,null,null,null,null,null,null,null,2,{"$f":"IF(F3>0,F4,IF($C$8>=2,$F$5,0))","v":103950},{"$f":"M12+N12-L13","v":800222.55661945674},7294.4492936489005,5908.5039278556096,96655.550706351103,{"$f":"IF(L13<=0,0,(+Q12-L13+R12))","v":799521.70833333337},6662.6809027777781,{"$f":"N13*$S$9/100","v":1385.9453657932911},754.17697492216848]
[null,null,null,null,null,null,null,null,null,null,3,{"$f":"IF($C$8>=$K14,$F$5,0)","v":103950},{"$f":"M13+N13-L14","v":703567.00591310568},6413.3831355594921,5194.8403398031887,97536.616864440512,702234.38923611119,5851.9532436342597,{"$f":"N14*$S$9/100","v":1218.5427957563036},657.11290383107098]
[null,null,null,null,null,null,null,null,null,null,4,103950,{"$f":"M14+N14-L15","v":606030.38904866518},5524.2855962482354,4474.6713329610702,98425.714403751772,604136.34247974551,5034.4695206645456,{"$f":"N15*$S$9/100","v":1049.6142632871647},559.79818770347538]
[null,null,null,null,null,null,null,null,null,null,5,103950,{"$f":"IF(L16<=0,0,(+M15+N15-L16))","v":507604.67464491341},4627.0834654530654,3747.9376070169828,99322.916534546937,505220.81200041005,4210.1734333367503,879.14585843608245,462.23582631976751]
[null,null,null,null,null,null,null,null,null,null,6,103950,408281.75811036647,3721.7028655618892,3014.5793211051305,100228.29713443811,405480.98543374683,3379.0082119478902,707.12354445675896,364.42889084275976]
[null,null,null,null,null,null,null,null,null,null,7,103950,308053.46097592835,2808.0692455293424,2274.5360888787673,101141.93075447065,304909.99364569469,2540.9166137141224,533.53315665057505,266.38052483535512]
[null,null,null,null,null,null,null,null,null,null,8,103950,206911.53022145771,1886.1073747380888,1527.7469735378518,102063.89262526191,203500.91025940882,1695.840918828407,358.36040120023688,168.09394529055521]
[null,null,null,null,null,null,null,null,null,null,9,103950,104847.6375961958,955.74133680416514,774.15048281137376,102994.25866319584,101246.75117823723,843.72292648531038,181.59085399279138,69.572443673936618]
[null,null,null,null,null,null,null,null,null,null,10,103950,1853.3789329999563,16.894523325858184,13.684563893945128,103933.10547667414,-1859.5258952774584,-15.496049127312155,3.2099594319130551,-29.180613021257283]
[null,null,null,null,null,null,null,null,null,null,11,0,0,0,0,0,0,0,0,0]
[null,null,null,null,null,null,null,null,null,null,12,0,0,0,0,0,0,0,0,0]
[null,null,null,null,null,null,null,null,null,null,13]
[null,null,null,null,null,null,null,null,null,null,"-","-","-","-","-","-","-","-","-","-"]
[null,null,null,null,null,null,null,null,null,null,null,{"$f":"SUM(L12:L25)","v":1039545},null,{"$f":"SUM(N12:N25)","v":41415.273456325827},{"$f":"SUM(O12:O25)","v":33546.371499623921},{"$f":"SUM(P12:P25)","v":998129.72654367425},null,{"$f":"SUM(R12:R25)","v":37669.978055595086},{"$f":"SUM(S12:S25)","v":7868.9019567019077},{"$f":"IF(ROUND(P84,0)<>0,0,SUM(T12:T25))","v":0}]
[null,null,null,null,null,null,null,null,null,null,"=","=","=","=","=","=","=","=","=","="]
[]
[]
[null,null,null,null,null,null,null,null,null,null,13,{"$f":"IF($C$8>=$K30,$F$5,0)","v":0},{"$f":"IF(L30<=0,0,(+M29+N29-L30))","v":0},{"$f":"M30*$C$10/100/12","v":0},null,{"$f":"L30-N30","v":0}]
[null,null,null,null,null,null,null,null,null,null,{"$f":"K30+1","v":14},0,0,0,null,0]
[null,null,null,null,null,null,null,null,null,null,15,0,0,0,null,0]
[null,null,null,null,null,null,null,null,null,null,16,0,0,0,null,0]
[null,null,null,null,null,null,null,null,null,null,17,0,0,0,null,0]
[null,null,null,null,null,null,null,null,null,null,18,0,0,0,null,0]
[null,null,null,null,null,null,null,null,null,null,19,0,0,0,null,0]
[null,null,null,null,null,null,null,null,null,null,20,0,0,0,null,0]
[null,null,null,null,null,null,null,null,null,null,21,0,0,0,null,0]
[null,null,null,null,null,null,null,null,null,null,22,0,0,0,null,0]
[null,null,null,null,null,null,null,null,null,null,23,0,0,0,null,0]
{"$rows_left_out":45}
{"sheet":"Workings (A)","index":4,"n_rows":73,"n_cols":23,"rows_kept":73,"cut":false,"hidden":true,"merged":[[33,4,33,6]]}
["APR Calculation - Premium Credit Limit"]
[]
["This APR is calculated on the assumptions that:"]
["• As this calculation is being done at 'Quotation' PCL will be using the Predicted Credit Limit for these purposes "]
["• the agreement remains valid for the period agreed and that the parties fulfil their obligations under the terms and by the dates specified in the agreement;"]
["• the rate of the transaction fee will remain at the initial level and will be applicable for the duration of the agreement;"]
["• the Credit Limit is drawn down immediately and in full;"]
["• the credit is provided for a period of one year starting from the date of the initial drawdown, the capital is repaid in equal"]
["monthly payments commencing one month after the date of the initial drawdown, the final payment made by you clears the"]
["balance of capital and charges, and that charges are applied in accordance with that drawdown and repayments of capital and as"]
["provided for in the consumer credit agreement."]
[]
["Please input the variable data in the green highlighted fields and the APR can then be calculated using the assumptions below"]
[]
["Quotation"]
["Premium",null,{"$f":"Quotation!C16","v":1000000}]
["Loan Arrangement/Facility Fee",{"$f":"Quotation!C17","v":"Yes"},{"$f":"COUNTIF(B17,\"YES\")*IF(C16>E38,G38,IF(C16>E37,G37,IF(C16>E36,G36,\"error\")))","v":45}]
["No of Instalments",null,{"$f":"Quotation!C20","v":6}]
["Transaction Fee/Service Charge",{"$f":"Quotation!C18","v":2.4E-2},{"$f":"MAX((+C16*B19),C20)","v":24000}]
["Minimum Transaction Fee",{"$f":"IF(C20=0,\"No\",\"Yes\")","v":"Yes"},{"$f":"Quotation!C19","v":25}]
["Minimum Transaction Fee (%)",{"$f":"+C20/C16","v":2.5000000000000001E-5}]
["Total Amount Payable",null,{"$f":"+C16+C19+C17","v":1024045}]
["Predicted Credit Limit for APR Purposes",null,{"$f":"C16+C17+C19","v":1024045}]
["Initial Direct Debit of ",null,{"$f":"(+($C$16+$C$19)/$C$18)+C17","v":170711.66666666666}]
["Followed by X instalments of ",null,{"$f":"+(C16+C19)/C18","v":170666.66666666666}]
[]
["Representative APR"]
[null,{"$f":"K66","v":4.4999999999999998E-2},"APR Variable"]
[]
[]
[]
["APR Total Amount Payable Calculation"]
["Actual Credit Limit for Quotation Purposes",null,{"$f":"C23","v":1024045}]
["Transaction Fees",{"$f":"+B19","v":2.4E-2},{"$f":"MAX((+C33*B34),C38)","v":24577.08},null,"Fees Table"]
["Other Fees (eg Facility Fee/Loan Arrangement Fee)",{"$f":"+B17","v":"Yes"},{"$f":"COUNTIF(B35,\"YES\")*IF(C33>E38,G38,IF(C33>E37,G37,IF(C33>E36,G36,\"error\")))","v":45},null,"From","To","Fee"]
[null,null,{"$f":"+C33+C34+C35","v":1048667.08},null,1.0000000000000001E-5,{"$f":"+E37","v":999.99900000000002},10]
[null,null,null,null,999.99900000000002,{"$f":"+E38","v":4999.9989999999998},25]
["MSC (Min Service Charge)",{"$f":"+C38/C33","v":2.4412989663540178E-5},{"$f":"C20","v":25},null,4999.9989999999998,99999999,45]
[]
[]
{"$rows_left_out":34}
{"sheet":"Workings (B)","index":5,"n_rows":73,"n_cols":23,"rows_kept":73,"cut":false,"hidden":true,"merged":[[33,4,33,6]]}
["APR Calculation - Premium Credit Limit"]
[]
["This APR is calculated on the assumptions that:"]
["• As this calculation is being done at 'Quotation' PCL will be using the Predicted Credit Limit for these purposes "]
["• the agreement remains valid for the period agreed and that the parties fulfil their obligations under the terms and by the dates specified in the agreement;"]
["• the rate of the transaction fee will remain at the initial level and will be applicable for the duration of the agreement;"]
["• the Credit Limit is drawn down immediately and in full;"]
["• the credit is provided for a period of one year starting from the date of the initial drawdown, the capital is repaid in equal"]
["monthly payments commencing one month after the date of the initial drawdown, the final payment made by you clears the"]
["balance of capital and charges, and that charges are applied in accordance with that drawdown and repayments of capital and as"]
["provided for in the consumer credit agreement."]
[]
["Please input the variable data in the green highlighted fields and the APR can then be calculated using the assumptions below"]
[]
["Quotation"]
["Premium",null,{"$f":"Quotation!C16","v":1000000}]
["Loan Arrangement/Facility Fee",{"$f":"Quotation!D17","v":"Yes"},{"$f":"COUNTIF(B17,\"YES\")*IF(C16>E38,G38,IF(C16>E37,G37,IF(C16>E36,G36,\"error\")))","v":45}]
["No of Instalments",null,{"$f":"Quotation!D20","v":8}]
["Transaction Fee/Service Charge",{"$f":"Quotation!D18","v":3.2000000000000001E-2},{"$f":"MAX((+C16*B19),C20)","v":32000}]
["Minimum Transaction Fee",{"$f":"IF(C20=0,\"No\",\"Yes\")","v":"Yes"},{"$f":"Quotation!D19","v":25}]
["Minimum Transaction Fee (%)",{"$f":"+C20/C16","v":2.5000000000000001E-5}]
["Total Amount Payable",null,{"$f":"+C16+C19+C17","v":1032045}]
["Predicted Credit Limit for APR Purposes",null,{"$f":"C16+C17+C19","v":1032045}]
["Initial Direct Debit of ",null,{"$f":"(+($C$16+$C$19)/$C$18)+C17","v":129045}]
["Followed by X instalments of ",null,{"$f":"+(C16+C19)/C18","v":129000}]
[]
["Representative APR"]
[null,{"$f":"K66","v":0.06},"APR Variable"]
[]
[]
[]
["APR Total Amount Payable Calculation"]
["Actual Credit Limit for Quotation Purposes",null,{"$f":"C23","v":1032045}]
["Transaction Fees",{"$f":"+B19","v":3.2000000000000001E-2},{"$f":"MAX((+C33*B34),C38)","v":33025.440000000002},null,"Fees Table"]
["Other Fees (eg Facility Fee/Loan Arrangement Fee)",{"$f":"+B17","v":"Yes"},{"$f":"COUNTIF(B35,\"YES\")*IF(C33>E38,G38,IF(C33>E37,G37,IF(C33>E36,G36,\"error\")))","v":45},null,"From","To","Fee"]
[null,null,{"$f":"+C33+C34+C35","v":1065115.44},null,1.0000000000000001E-5,{"$f":"+E37","v":999.99900000000002},{"$f":"'Workings (A)'!G36","v":10}]
[null,null,null,null,999.99900000000002,{"$f":"+E38","v":4999.9989999999998},{"$f":"'Workings (A)'!G37","v":25}]
["MSC (Min Service Charge)",{"$f":"+C38/C33","v":2.4223749933384687E-5},{"$f":"C20","v":25},null,4999.9989999999998,99999999,{"$f":"'Workings (A)'!G38","v":45}]
[]
[]
{"$rows_left_out":34}
{"sheet":"Workings (C)","index":6,"n_rows":73,"n_cols":23,"rows_kept":73,"cut":false,"hidden":true,"merged":[[33,4,33,6]]}
["APR Calculation - Premium Credit Limit"]
[]
["This APR is calculated on the assumptions that:"]
["• As this calculation is being done at 'Quotation' PCL will be using the Predicted Credit Limit for these purposes "]
["• the agreement remains valid for the period agreed and that the parties fulfil their obligations under the terms and by the dates specified in the agreement;"]
["• the rate of the transaction fee will remain at the initial level and will be applicable for the duration of the agreement;"]
["• the Credit Limit is drawn down immediately and in full;"]
["• the credit is provided for a period of one year starting from the date of the initial drawdown, the capital is repaid in equal"]
["monthly payments commencing one month after the date of the initial drawdown, the final payment made by you clears the"]
["balance of capital and charges, and that charges are applied in accordance with that drawdown and repayments of capital and as"]
["provided for in the consumer credit agreement."]
[]
["Please input the variable data in the green highlighted fields and the APR can then be calculated using the assumptions below"]
[]
["Quotation"]
["Premium",null,{"$f":"Quotation!C16","v":1000000}]
["Loan Arrangement/Facility Fee",{"$f":"Quotation!E17","v":"Yes"},{"$f":"COUNTIF(B17,\"YES\")*IF(C16>E38,G38,IF(C16>E37,G37,IF(C16>E36,G36,\"error\")))","v":45}]
["No of Instalments",null,{"$f":"Quotation!E20","v":10}]
["Transaction Fee/Service Charge",{"$f":"Quotation!E18","v":3.95E-2},{"$f":"MAX((+C16*B19),C20)","v":39500}]
["Minimum Transaction Fee",{"$f":"IF(C20=0,\"No\",\"Yes\")","v":"Yes"},{"$f":"Quotation!E19","v":25}]
["Minimum Transaction Fee (%)",{"$f":"+C20/C16","v":2.5000000000000001E-5}]
["Total Amount Payable",null,{"$f":"+C16+C19+C17","v":1039545}]
["Predicted Credit Limit for APR Purposes",null,{"$f":"C16+C17+C19","v":1039545}]
["Initial Direct Debit of ",null,{"$f":"(+($C$16+$C$19)/$C$18)+C17","v":103995}]
["Followed by X instalments of ",null,{"$f":"+(C16+C19)/C18","v":103950}]
[]
["Representative APR"]
[null,{"$f":"K66","v":7.4999999999999997E-2},"APR Variable"]
[]
[]
[]
["APR Total Amount Payable Calculation"]
["Actual Credit Limit for Quotation Purposes",null,{"$f":"C23","v":1039545}]
["Transaction Fees",{"$f":"+B19","v":3.95E-2},{"$f":"MAX((+C33*B34),C38)","v":41062.027500000004},null,"Fees Table"]
["Other Fees (eg Facility Fee/Loan Arrangement Fee)",{"$f":"+B17","v":"Yes"},{"$f":"COUNTIF(B35,\"YES\")*IF(C33>E38,G38,IF(C33>E37,G37,IF(C33>E36,G36,\"error\")))","v":45},null,"From","To","Fee"]
[null,null,{"$f":"+C33+C34+C35","v":1080652.0275000001},null,1.0000000000000001E-5,{"$f":"+E37","v":999.99900000000002},{"$f":"'Workings (A)'!G36","v":10}]
[null,null,null,null,999.99900000000002,{"$f":"+E38","v":4999.9989999999998},{"$f":"'Workings (A)'!G37","v":25}]
["MSC (Min Service Charge)",{"$f":"+C38/C33","v":2.4048982968510262E-5},{"$f":"C20","v":25},null,4999.9989999999998,99999999,{"$f":"'Workings (A)'!G38","v":45}]
[]
[]
{"$rows_left_out":33}